Skip to Content

Introduction

This is the continuation of the blog started here.

This blog has been split in 3 parts:

Link Content
Part1 Introduction and some preliminary steps
Part2 Preview apps on the emulator and on the device (iOS and Android)
Part3 (this page) Run apps on the emulator and on the device (iOS and Android)

In this part we are going to see how to run the mobile app we created in the first part of the blog on a mobile emulator/device. The first thing to do is to use HAT to deploy the app on the local machine and then push the app as stand-alone on the mobile emulator/device. We will see as well how to update the app and push it again to all the devices which have installed it. This will be done through HCPms.

Deploy the app on local HAT

At this moment the application is still inside SAP Web IDE. What we have seen in the previous part is that a link to the preview page is sent to the Companion App and this app takes care to show this preview as it was a stand-alone application. So far, only the Companion app is installed on the mobile device.

Now we’ll see how to deploy the app from SAP Web IDE to your local machine (PC or Mac) so that you can push the generated .apk (Android) or .ipa (iOS) files to your device.

1) Open SAP Web IDE

2) Right click on the name of your project and choose Deploy –> Deploy to local Hybrid App Toolkit

/wp-content/uploads/2015/08/26_837846.jpg

3) The deployment starts: you can follow its status by the console window

4) At the end of the process click on OK

/wp-content/uploads/2015/08/27_837847.jpg

5) If you look in your user folder you will find a subfolder called SAPHybrid. Inside of it there will be another subfolder with the name of your project containing all the needed files for deployment of the app on the mobile device

/wp-content/uploads/2015/08/15_774287.jpg

6) Congratulations! You have deployed your app on your local HAT!

Run the app on the emulator

We’ll firstly run the app on the Android emulator/iOS Simulator

1) Open SAP Web IDE

2) Right click on the index.html in your project and choose Run –> Run on –> (Android Emulator | iOS Simulator)

/wp-content/uploads/2015/08/28_837848.jpg

3) If you are running your app on the Android emulator you may get this further screen. Since we are just doing a test you can select Test Key and click on OK

/wp-content/uploads/2015/08/29_837849.jpg

4) The application which has been built by the deployment operation in the previous chapter is being pushed now to the emulator. You can check the status of the process in SAP Web IDE by enabling the console from the menu View –> Console. Once the application has been pushed onto your emulator, enter your SCN credentials and hit <ENTER>

/wp-content/uploads/2015/08/18_774608.jpg

5) We don’t need a passcode for this exercise, so click on Disable Passcode

/wp-content/uploads/2015/08/19_774609.jpg

6) Click on Submit

/wp-content/uploads/2015/08/20_774610.jpg

7) Your application starts successfully

/wp-content/uploads/2015/08/21_774611.jpg

8) You can also click on one of the products to see its details

/wp-content/uploads/2015/08/22_774612.jpg

9) At this point we can’t go any further with the emulator because it’s not able to use the camera of our underlying hardware (well, Android emulator can but it needs to be properly configured!), so we prefer to use real devices for preview: let’s go to the next chapter, then!

Run the app on the device

In order to run the app on a real device the steps are pretty the same as for the emulator so I won’t report here all the screenshots again, but just the description of the steps.

1) Open SAP Web IDE

2) Right click on the index.html in your project and choose Run –> Run on –> (Android device | iOS device)

3) If you are running your app on the Android emulator you might get a further screen where you have to choose between using a Test Key or a Custom Key. Since we are just doing a test you can select Test Key and click on OK

4) The application which has been built by the deployment operation in the previous chapter is being pushed to the emulator. You can check the status of the process in SAP Web IDE by enabling the console from the menu View –> Console. Once the application has been pushed onto your emulator, enter your SCN credentials and hit <ENTER>

5) Click on Disable Passcode

6) Click on Submit

7) Your application starts successfully

8) You can also click on one of the products to see its details

9) Click on the Barcode Scanner button

10) The camera is invoked: you might be requested to allow the use of the camera on your device for this app. Please allow it and put the barcode you printed/downloaded in the first part of this blog in front of the camera: the barcode is automatically recognised

droid@screen-7.png

11) The product related to this code is found in the product list

droid@screen-8.png

12) Congratulations! You have successfully installed and executed the app on your device!

Update the app and re-deploy it on HCPms

Let’s assume now that you want to change your app and push the changes to all the devices which have installed your application. How can you easily do it? The best thing to do is to change the app, re-deploy it on HCPms so that, after the deployment, all the devices/emulators running this app, will be informed that there is a new version of the app ready to be installed.

1) Open SAP Web IDE

2) In the Products project, open the file Master.view.xml by double clicking on it

3) Add the following line just after the one related to the Barcode Scanner button

<Button id=”testbutton” icon=”sap-icon://overflow”></Button>

/wp-content/uploads/2015/08/30_837850.jpg

4) Save the file

5) Test this new change in the layout by running the application in preview mode

/wp-content/uploads/2015/08/31_837851.jpg

6) Right click on the name of the project and choose Deploy –> Deploy to HCP Mobile Services

/wp-content/uploads/2015/08/32_837852.jpg

7) If required, enter again your SCN credentials

8) The Application ID field comes already populated, you just need to press Next

/wp-content/uploads/2015/08/33_837853.jpg

9) The package creation process might take time. When finished click on Browse to locate the zip file you need to upload to the server. The path to this file is also reported on this window

/wp-content/uploads/2015/08/34_837854.jpg

10) Locate the file and click on Open

/wp-content/uploads/2015/08/35_837855.jpg

11) Click on Deploy

/wp-content/uploads/2015/08/36_837856.jpg

12) The deployment phase takes some time too, depending on your upload speed. When finished click on Close

/wp-content/uploads/2015/08/37_837857.jpg

13) Now open the HCMms cockpit and click on the Applications tile

/wp-content/uploads/2015/08/38_837858.jpg

14) Click on the com.test.products application and then on Configure

/wp-content/uploads/2015/08/39_837859.jpg

15) Open the App Specific Settings tab and select the platforms which you want to deploy the new version for (in my case I’m doing it for both). Then click on Deploy

/wp-content/uploads/2015/08/40_837860.jpg

16) The new version is deployed. Now you need to open again the application on your device and after a certain time you should be prompted that a new version is available for this application. You can choose if you want to use this new version now or later. Choose Relaunch Now

/wp-content/uploads/2015/08/35_837855.jpg

17) The new application is launched

/wp-content/uploads/2015/08/36_837856.jpg

18) Congratulations! You have successfully updated your mobile app though HCPms!

To report this post you need to login first.

27 Comments

You must be Logged on to comment or reply to a post.

  1. Hans Verreydt

    Great blog!

    I was wondering how I can enable the “Deploy to HCP Mobile Services” button in Web IDE?

    This option is disabled in my account, and I’m not sure how I can enable this…

    Regards,

    Hans

    (0) 
    1. Midhun VP

      Hi Hans,

      Deploy to Mobile services/mobile platform option is provided to make use of the Kapsel appupdate plugin.

      If you add this plugin to your project, this option will be enabled. To enable this plugin right click on the project>project settings>device configurations>choose appupdate plugin under kapsel.

      Then, you will find the deploy to mobile service enabled.

      This blog should be helpful: http://scn.sap.com/community/developer-center/front-end/blog/2015/06/10/prerequisites-app-update-deploy-a-hybrid-application-to-sap-hana-cloud-platform-mobile-services-hcpms-for-updates

      Regards, Midhun

      SAP Technology RIG

      (1) 
  2. Matthias Hubert

    Hello Simmaco,

    I installed the HAT as described in your tutorial and I was able to run the app on an Android Emulator. However when I tried to run the app on an Android Emulator today I get a popup saying:

    The HAT Connector v1.9.7 is older than the Web IDE HAT plugin v1.10.2. You may run into compatibility issue, if you continue to use local HAT v1.9.7.

    And then the following error message is written to the console:

    12:58:57 PM (hybrid-toolkit) Invalid command

    12:58:57 PM (hybrid-toolkit) The emulate command execute failure reason: Hybrid Toolkit utility command is not executed

    I assume that the HAT connector in Web-IDE was upgraded to a new version and I have now to upgrade also my local HAT to v.10.2.

    Is it possible to switch back to the HAT connector in WEB-IDE to v1.9.7 in order to avoid that I have to do a time consuming upgrade of my local HAT connector?

    Best regards,
    Matthias

    (0) 
    1. Simmaco Ferriero Post author

      Hi Matthias,

      unfortunately it’s not possible to switch back to the old HAT plugin. You need to upgrade  your local connector to the newer version. I think that the installation this time is pretty straightforward because the prerequisites between 1.10.2 and 1.9.7 are pretty the same, so you just need to run the setup and follow the instructions on the web page.

      Regards,

      Simmaco

      (0) 
  3. Sandip Agarwalla

    HI Simmaco Ferriero

    How do we get the .apk or .ipa files for manually pushing the app to devices. We are currently not using HCPms.

    Is there a way we can get the deployable files? Does the option ‘deploy to local HAT’ give the .apk/.ipa files?

    Thanks

    Sandip

    (0) 
    1. Simmaco Ferriero Post author

      Once you have deployed your project to your HAT Local folder,

      1. open a Terminal window
      2. go into the ../SAPHybrid/<appname>/hybrid folder
      3. run the command “cordova build”

      When finished you will be able to find the related packages under:

      1. Android: ../SAPHybrid/<appname>/hybrid/platforms/android/build/outputs/apk/android-release-unaligned.apk
      2. iOS: ../SAPHybrid/<appname>/hybrid/platforms/ios/build/emulator/<appname>.app

      Regards,

      Simmaco

      (0) 
  4. Ana Velasquez

    Hi Simmaco Ferriero, I’ve developed a fiori app in webide whichs runs well on Android device but when I deploy the same application to my iOS device, it doesn’t run. Do you know or suspect what is going wrong? I’m working with HAT.

    Any help would be appreciated, I’m running on this error for days now.

    Best regards,

    Ana

    (0) 
    1. Simmaco Ferriero Post author

      Hi Ana,

      have you used any particular custom cordova plugin in your application?

      If yes, which ones?

      Which kind of error do you get when running on iOS?

      Did you also tried on the iOS Simulator?

      Regards,

      Simmaco

      (0) 
      1. Ana Velasquez

        Simmaco Ferriero, I’m not using any custom cordova plugin. The cordova plugins that I’m using are Network Connection, Device Info, Camera and Debug Console. I’m also using some Kapsel plugins as Logon, App Update, and Barcode Scanner.

        In Device Configuration I select the Debug option in Build Configuration, when I deploy the app to HAT it doesn’t shows me any error, and when I run it on the iOS Device, it generate the .IPA well without any errors. Then from iTunes I select the IPA generated and install it on the device. When the app opens in the device it just stays in blank, a white screen. Then I go to the safari’s web inspector and in console it doesn’t shows me any error either.

        I’ve also tried with “Run on iOS Simulator”, and the build is succeed but it tells me that doesn’t find the plist file and don’t opens the simulator.

        Best regards,

        Ana

        (0) 
        1. Simmaco Ferriero Post author

          Hi Ana,

          I did a test on my side: I created a new Fiori app with the same Cordova/Kapsel plugins you used and it works fine on the iOS emulator.

          So, in order to narrow down the causes of your problem, could you please try to create a very basic app starting for example with the “SAPUI5 Application” template and see if, after adding the same plugins, it starts on the iOS Simulator? Maybe there is something in your app which is causing this issue.

          You can also write me in private so that we can continue our conversation by email without flooding this thread.

          Thanks and regards,

          Simmaco

          (0) 
          1. Ana Velasquez

            Hi Simmaco, I’ve already did what you recommended me, how can I write you in private? To tell you my result.

            Thank you very much.

            Best regards,

            Ana

            (0) 
            1. Michael Appleby

              If you need to communicate privately (not preferred, by the way), please Follow each other and you should be able to DM each other.  If that method does not work, contact me via email (to Simmaco) and I will set up a DM for you to use.  Alternatively either of you can make your email available publicly (everyone) in your profile. 

              Cheers, Mike (Moderator)

              SAP Technology RIG

              (0) 
  5. Sivaganesh K

    When i run the offline application on my android emulator. The emulator loads but it doesnt display the registration screen which is shown in this blog. Am i missing something ?

    (0) 
  6. Tijo Simon

    Hi Simmaco,

    I am using HAT 1_22_2. Success messages in webIDE console during Deploy and Run on Android Simulator, but see a light blue screen on simualor and not the kapsel login screen.

    Please share your thoughts on if this is a bug or something I have done incorrect.

    Regards,

    Tijo Simon

    (0) 
      1. Christoph Jegler

        Hi Tijo,

        I had the same problem. Try to start the application from windows command-line-tool and not from WEB IDE. Let me know if you need more information.

        Best regards,

        Christoph

        (0) 
  7. Lu Nguyen

    hi Simmaco Ferriero,

    When i run this app on my Iphone from Web Ide. I face with error:

    ——————-

    12:01:42 PM (hybrid-toolkit) Signing for “demo” requires a development team. Select a development team in the project editor.
    12:01:42 PM (hybrid-toolkit) Code signing is required for product type ‘Application’ in SDK ‘iOS 10.2’
    12:01:42 PM (hybrid-toolkit)
    12:01:42 PM (hybrid-toolkit) ** BUILD FAILED **
    12:01:42 PM (hybrid-toolkit)
    12:01:42 PM (hybrid-toolkit)
    12:01:42 PM (hybrid-toolkit) The following build commands failed:
    12:01:42 PM (hybrid-toolkit) Check dependencies
    12:01:42 PM (hybrid-toolkit) (1 failure)
    12:01:42 PM (hybrid-toolkit) Error: Error code 65 for command: xcodebuild with args: -xcconfig,/Users/developer/SAPHybrid/DemoApp/hybrid/platforms/ios/cordova/build-release.xcconfig,-project,demo.xcodeproj,ARCHS=armv7 arm64,-target,demo,-configuration,Release,-sdk,iphoneos,build,VALID_ARCHS=armv7 arm64,CONFIGURATION_BUILD_DIR=/Users/developer/SAPHybrid/DemoApp/hybrid/platforms/ios/build/device,SHARED_PRECOMPS_DIR=/Users/developer/SAPHybrid/DemoApp/hybrid/platforms/ios/build/sharedpch
    12:01:42 PM (hybrid-toolkit) run ios exited with error code 1
    12:01:42 PM (hybrid-toolkit)
    12:01:42 PM (hybrid-toolkit) When you try to build iOS project, if the xCode developer file is not configured correctly, the error may occur.
    12:01:42 PM (hybrid-toolkit) Verify your xCode environment by building the project from $PATh in xCode. If the error still persists, check if you have setup your xCode environment correctly.
    12:01:42 PM (hybrid-toolkit)
    12:01:42 PM (hybrid-toolkit) The node process of the “run” script exited with code 1.
    12:01:42 PM (hybrid-toolkit) The run command execute failure reason: Hybrid Toolkit utility exited with error

    ——————-

    Do I miss something?

    Best regards,

    Lu Nguyen.

    (0) 
  8. Jay Malla

    I am having the same issue.  “Code signing is required for product type ‘Application’ in SDK ‘iOS 10.2”

    Is there something we need to do in XCode preferences to get this working?  I get the following error when trying to do the Hybrid application toolkit test for iOS:

    Check dependencies

    No profiles for ‘com.sap.ide.companion’ were found:  Xcode couldn’t find a provisioning profile matching ‘com.sap.ide.companion’.

    warning: no rule to process file ‘/Users/jaymalla/SAP/SAP_HAT_local-1.24.1/WebIdeCompanion/companionapp/CompanionApp/platforms/ios/WebIdeCompanion/Plugins/cordova-plugin-privacyscreen/PrivacyScreenPlugin.h’ of type sourcecode.c.h for architecture armv7

    warning: no rule to process file ‘/Users/jaymalla/SAP/SAP_HAT_local-1.24.1/WebIdeCompanion/companionapp/CompanionApp/platforms/ios/WebIdeCompanion/Plugins/cordova-plugin-privacyscreen/PrivacyScreenPlugin.h’ of type sourcecode.c.h for architecture arm64

    Code signing is required for product type ‘Application’ in SDK ‘iOS 10.2’

    ** ARCHIVE FAILED **

    The following build commands failed:

    Check dependencies

    (1 failure)

    Error: Error code 65 for command: xcodebuild with args: -xcconfig,/Users/jaymalla/SAP/SAP_HAT_local-1.24.1/WebIdeCompanion/companionapp/CompanionApp/platforms/ios/cordova/build-debug.xcconfig,-workspace,WebIdeCompanion.xcworkspace,-scheme,WebIdeCompanion,-configuration,Debug,-destination,generic/platform=iOS,-archivePath,WebIdeCompanion.xcarchive,archive,CONFIGURATION_BUILD_DIR=/Users/jaymalla/SAP/SAP_HAT_local-1.24.1/WebIdeCompanion/companionapp/CompanionApp/platforms/ios/build/device,SHARED_PRECOMPS_DIR=/Users/jaymalla/SAP/SAP_HAT_local-1.24.1/WebIdeCompanion/companionapp/CompanionApp/platforms/ios/build/sharedpch

    cmd error

    The node process of the build script exited with code 1.

    Regards,

    Jay

    (0) 
    1. Sai Krishna

      Hello,

      Is there any update on this issue? i am getting the same issue. I have installed HAT 1.27.4

       

      -Best/SK

       

      ===================================================
      
      export LANG=en_US.US-ASCII
      
          export PATH="/Users/sai/Downloads/Xcode.app/Contents/Developer/Platforms/iPhoneOS.platform/Developer/usr/bin:/Users/sai/Downloads/Xcode.app/Contents/Developer/usr/bin:/usr/local/bin:/usr/bin:/bin:/usr/sbin:/sbin:/usr/local/bin/ant"
      
          /Users/sai/Downloads/Xcode.app/Contents/Developer/Toolchains/XcodeDefault.xctoolchain/usr/bin/clang -x objective-c -arch arm64 -fmessage-length=0 -fdiagnostics-show-note-include-stack -fmacro-backtrace-limit=0 -std=c99 -fobjc-arc -fmodules -fmodules-cache-path=/Users/sai/Library/Developer/Xcode/DerivedData/ModuleCache -fmodules-prune-interval=86400 -fmodules-prune-after=345600 -fbuild-session-file=/Users/sai/Library/Developer/Xcode/DerivedData/ModuleCache/Session.modulevalidation -fmodules-validate-once-per-build-session -Wno-trigraphs -fpascal-strings -O0 -Wno-missing-field-initializers -Wno-missing-prototypes -Wno-implicit-atomic-properties -Wno-arc-repeated-use-of-weak -Wduplicate-method-match -Wno-missing-braces -Wparentheses -Wswitch -Wunused-function -Wno-unused-label -Wno-unused-parameter -Wunused-variable -Wunused-value -Wempty-body -Wuninitialized -Wno-unknown-pragmas -Wno-shadow -Wno-four-char-constants -Wno-conversion -Wconstant-conversion -Wint-conversion -Wbool-conversion -Wenum-conversion -Wshorten-64-to-32 -Wpointer-sign -Wno-newline-eof -Wno-selector -Wno-strict-selector-match -Wundeclared-selector -Wno-deprecated-implementations -DDEBUG=1 -isysroot /Users/sai/Downloads/Xcode.app/Contents/Developer/Platforms/iPhoneOS.platform/Developer/SDKs/iPhoneOS10.2.sdk -fstrict-aliasing -Wprotocol -Wdeprecated-declarations -miphoneos-version-min=8.0 -g -Wno-sign-conversion -Wno-infinite-recursion -iquote /Users/sai/Library/Developer/Xcode/DerivedData/WebIdeCompanion-fyhbmpphzqelbccgxdymhbthhjaf/Build/Intermediates/ArchiveIntermediates/WebIdeCompanion/IntermediateBuildFilesPath/CordovaLib.build/Debug-iphoneos/CordovaLib.build/Cordova-generated-files.hmap -I/Users/sai/Library/Developer/Xcode/DerivedData/WebIdeCompanion-fyhbmpphzqelbccgxdymhbthhjaf/Build/Intermediates/ArchiveIntermediates/WebIdeCompanion/IntermediateBuildFilesPath/CordovaLib.build/Debug-iphoneos/CordovaLib.build/Cordova-own-target-headers.hmap -I/Users/sai/Library/Developer/Xcode/DerivedData/WebIdeCompanion-fyhbmpphzqelbccgxdymhbthhjaf/Build/Intermediates/ArchiveIntermediates/WebIdeCompanion/IntermediateBuildFilesPath/CordovaLib.build/Debug-iphoneos/CordovaLib.build/Cordova-all-target-headers.hmap -iquote /Users/sai/Library/Developer/Xcode/DerivedData/WebIdeCompanion-fyhbmpphzqelbccgxdymhbthhjaf/Build/Intermediates/ArchiveIntermediates/WebIdeCompanion/IntermediateBuildFilesPath/CordovaLib.build/Debug-iphoneos/CordovaLib.build/Cordova-project-headers.hmap -I/Users/sai/Downloads/tsk/SAP_HAT_local-1.27.4/WebIdeCompanion/companionapp/CompanionApp/platforms/ios/build/device/include -I/Users/sai/Library/Developer/Xcode/DerivedData/WebIdeCompanion-fyhbmpphzqelbccgxdymhbthhjaf/Build/Intermediates/ArchiveIntermediates/WebIdeCompanion/IntermediateBuildFilesPath/UninstalledProducts/iphoneos/usr/local/lib/include -I/Users/sai/Library/Developer/Xcode/DerivedData/WebIdeCompanion-fyhbmpphzqelbccgxdymhbthhjaf/Build/Intermediates/ArchiveIntermediates/WebIdeCompanion/IntermediateBuildFilesPath/UninstalledProducts/include -I/Users/sai/Library/Developer/Xcode/DerivedData/WebIdeCompanion-fyhbmpphzqelbccgxdymhbthhjaf/Build/Intermediates/ArchiveIntermediates/WebIdeCompanion/IntermediateBuildFilesPath/UninstalledProducts/iphoneos/include -I/Users/sai/Downloads/tsk/SAP_HAT_local-1.27.4/WebIdeCompanion/companionapp/CompanionApp/platforms/ios/build/device -I/Users/sai/Library/Developer/Xcode/DerivedData/WebIdeCompanion-fyhbmpphzqelbccgxdymhbthhjaf/Build/Intermediates/ArchiveIntermediates/WebIdeCompanion/IntermediateBuildFilesPath/CordovaLib.build/Debug-iphoneos/CordovaLib.build/DerivedSources/arm64 -I/Users/sai/Library/Developer/Xcode/DerivedData/WebIdeCompanion-fyhbmpphzqelbccgxdymhbthhjaf/Build/Intermediates/ArchiveIntermediates/WebIdeCompanion/IntermediateBuildFilesPath/CordovaLib.build/Debug-iphoneos/CordovaLib.build/DerivedSources -F/Users/sai/Downloads/tsk/SAP_HAT_local-1.27.4/WebIdeCompanion/companionapp/CompanionApp/platforms/ios/build/device -DDEBUG -include /Users/sai/Downloads/tsk/SAP_HAT_local-1.27.4/WebIdeCompanion/companionapp/CompanionApp/platforms/ios/build/sharedpch/CordovaLib_Prefix-finwdtoeujlxeielzffdkjrwtuqr/CordovaLib_Prefix.pch -MMD -MT dependencies -MF /Users/sai/Library/Developer/Xcode/DerivedData/WebIdeCompanion-fyhbmpphzqelbccgxdymhbthhjaf/Build/Intermediates/ArchiveIntermediates/WebIdeCompanion/IntermediateBuildFilesPath/CordovaLib.build/Debug-iphoneos/CordovaLib.build/Objects-normal/arm64/NSMutableArray+QueueAdditions.d --serialize-diagnostics /Users/sai/Library/Developer/Xcode/DerivedData/WebIdeCompanion-fyhbmpphzqelbccgxdymhbthhjaf/Build/Intermediates/ArchiveIntermediates/WebIdeCompanion/IntermediateBuildFilesPath/CordovaLib.build/Debug-iphoneos/CordovaLib.build/Objects-normal/arm64/NSMutableArray+QueueAdditions.dia -c /Users/sai/Downloads/tsk/SAP_HAT_local-1.27.4/WebIdeCompanion/companionapp/CompanionApp/platforms/ios/CordovaLib/Classes/Public/NSMutableArray+QueueAdditions.m -o /Users/sai/Library/Developer/Xcode/DerivedData/WebIdeCompanion-fyhbmpphzqelbccgxdymhbthhjaf/Build/Intermediates/ArchiveIntermediates/WebIdeCompanion/IntermediateBuildFilesPath/CordovaLib.build/Debug-iphoneos/CordovaLib.build/Objects-normal/arm64/NSMutableArray+QueueAdditions.o
      
      CompileC /Users/sai/Library/Developer/Xcode/DerivedData/WebIdeCompanion-fyhbmpphzqelbccgxdymhbthhjaf/Build/Intermediates/ArchiveIntermediates/WebIdeCompanion/IntermediateBuildFilesPath/CordovaLib.build/Debug-iphoneos/CordovaLib.build/Objects-normal/arm64/CDVCommandQueue.o Classes/Public/CDVCommandQueue.m normal arm64 objective-c com.apple.compilers.llvm.clang.1_0.compiler
      
          cd /Users/sai/Downloads/tsk/SAP_HAT_local-1.27.4/WebIdeCompanion/companionapp/CompanionApp/platforms/ios/CordovaLib
      
          export LANG=en_US.US-ASCII
      
          export PATH="/Users/sai/Downloads/Xcode.app/Contents/Developer/Platforms/iPhoneOS.platform/Developer/usr/bin:/Users/sai/Downloads/Xcode.app/Contents/Developer/usr/bin:/usr/local/bin:/usr/bin:/bin:/usr/sbin:/sbin:/usr/local/bin/ant"
      
          /Users/sai/Downloads/Xcode.app/Contents/Developer/Toolchains/XcodeDefault.xctoolchain/usr/bin/clang -x objective-c -arch arm64 -fmessage-length=0 -fdiagnostics-show-note-include-stack -fmacro-backtrace-limit=0 -std=c99 -fobjc-arc -fmodules -fmodules-cache-path=/Users/sai/Library/Developer/Xcode/DerivedData/ModuleCache -fmodules-prune-interval=86400 -fmodules-prune-after=345600 -fbuild-session-file=/Users/sai/Library/Developer/Xcode/DerivedData/ModuleCache/Session.modulevalidation -fmodules-validate-once-per-build-session -Wno-trigraphs -fpascal-strings -O0 -Wno-missing-field-initializers -Wno-missing-prototypes -Wno-implicit-atomic-properties -Wno-arc-repeated-use-of-weak -Wduplicate-method-match -Wno-missing-braces -Wparentheses -Wswitch -Wunused-function -Wno-unused-label -Wno-unused-parameter -Wunused-variable -Wunused-value -Wempty-body -Wuninitialized -Wno-unknown-pragmas -Wno-shadow -Wno-four-char-constants -Wno-conversion -Wconstant-conversion -Wint-conversion -Wbool-conversion -Wenum-conversion -Wshorten-64-to-32 -Wpointer-sign -Wno-newline-eof -Wno-selector -Wno-strict-selector-match -Wundeclared-selector -Wno-deprecated-implementations -DDEBUG=1 -isysroot /Users/sai/Downloads/Xcode.app/Contents/Developer/Platforms/iPhoneOS.platform/Developer/SDKs/iPhoneOS10.2.sdk -fstrict-aliasing -Wprotocol -Wdeprecated-declarations -miphoneos-version-min=8.0 -g -Wno-sign-conversion -Wno-infinite-recursion -iquote /Users/sai/Library/Developer/Xcode/DerivedData/WebIdeCompanion-fyhbmpphzqelbccgxdymhbthhjaf/Build/Intermediates/ArchiveIntermediates/WebIdeCompanion/IntermediateBuildFilesPath/CordovaLib.build/Debug-iphoneos/CordovaLib.build/Cordova-generated-files.hmap -I/Users/sai/Library/Developer/Xcode/DerivedData/WebIdeCompanion-fyhbmpphzqelbccgxdymhbthhjaf/Build/Intermediates/ArchiveIntermediates/WebIdeCompanion/IntermediateBuildFilesPath/CordovaLib.build/Debug-iphoneos/CordovaLib.build/Cordova-own-target-headers.hmap -I/Users/sai/Library/Developer/Xcode/DerivedData/WebIdeCompanion-fyhbmpphzqelbccgxdymhbthhjaf/Build/Intermediates/ArchiveIntermediates/WebIdeCompanion/IntermediateBuildFilesPath/CordovaLib.build/Debug-iphoneos/CordovaLib.build/Cordova-all-target-headers.hmap -iquote /Users/sai/Library/Developer/Xcode/DerivedData/WebIdeCompanion-fyhbmpphzqelbccgxdymhbthhjaf/Build/Intermediates/ArchiveIntermediates/WebIdeCompanion/IntermediateBuildFilesPath/CordovaLib.build/Debug-iphoneos/CordovaLib.build/Cordova-project-headers.hmap -I/Users/sai/Downloads/tsk/SAP_HAT_local-1.27.4/WebIdeCompanion/companionapp/CompanionApp/platforms/ios/build/device/include -I/Users/sai/Library/Developer/Xcode/DerivedData/WebIdeCompanion-fyhbmpphzqelbccgxdymhbthhjaf/Build/Intermediates/ArchiveIntermediates/WebIdeCompanion/IntermediateBuildFilesPath/UninstalledProducts/iphoneos/usr/local/lib/include -I/Users/sai/Library/Developer/Xcode/DerivedData/WebIdeCompanion-fyhbmpphzqelbccgxdymhbthhjaf/Build/Intermediates/ArchiveIntermediates/WebIdeCompanion/IntermediateBuildFilesPath/UninstalledProducts/include -I/Users/sai/Library/Developer/Xcode/DerivedData/WebIdeCompanion-fyhbmpphzqelbccgxdymhbthhjaf/Build/Intermediates/ArchiveIntermediates/WebIdeCompanion/IntermediateBuildFilesPath/UninstalledProducts/iphoneos/include -I/Users/sai/Downloads/tsk/SAP_HAT_local-1.27.4/WebIdeCompanion/companionapp/CompanionApp/platforms/ios/build/device -I/Users/sai/Library/Developer/Xcode/DerivedData/WebIdeCompanion-fyhbmpphzqelbccgxdymhbthhjaf/Build/Intermediates/ArchiveIntermediates/WebIdeCompanion/IntermediateBuildFilesPath/CordovaLib.build/Debug-iphoneos/CordovaLib.build/DerivedSources/arm64 -I/Users/sai/Library/Developer/Xcode/DerivedData/WebIdeCompanion-fyhbmpphzqelbccgxdymhbthhjaf/Build/Intermediates/ArchiveIntermediates/WebIdeCompanion/IntermediateBuildFilesPath/CordovaLib.build/Debug-iphoneos/CordovaLib.build/DerivedSources -F/Users/sai/Downloads/tsk/SAP_HAT_local-1.27.4/WebIdeCompanion/companionapp/CompanionApp/platforms/ios/build/device -DDEBUG -include /Users/sai/Downloads/tsk/SAP_HAT_local-1.27.4/WebIdeCompanion/companionapp/CompanionApp/platforms/ios/build/sharedpch/CordovaLib_Prefix-finwdtoeujlxeielzffdkjrwtuqr/CordovaLib_Prefix.pch -MMD -MT dependencies -MF /Users/sai/Library/Developer/Xcode/DerivedData/WebIdeCompanion-fyhbmpphzqelbccgxdymhbthhjaf/Build/Intermediates/ArchiveIntermediates/WebIdeCompanion/IntermediateBuildFilesPath/CordovaLib.build/Debug-iphoneos/CordovaLib.build/Objects-normal/arm64/CDVCommandQueue.d --serialize-diagnostics /Users/sai/Library/Developer/Xcode/DerivedData/WebIdeCompanion-fyhbmpphzqelbccgxdymhbthhjaf/Build/Intermediates/ArchiveIntermediates/WebIdeCompanion/IntermediateBuildFilesPath/CordovaLib.build/Debug-iphoneos/CordovaLib.build/Objects-normal/arm64/CDVCommandQueue.dia -c /Users/sai/Downloads/tsk/SAP_HAT_local-1.27.4/WebIdeCompanion/companionapp/CompanionApp/platforms/ios/CordovaLib/Classes/Public/CDVCommandQueue.m -o /Users/sai/Library/Developer/Xcode/DerivedData/WebIdeCompanion-fyhbmpphzqelbccgxdymhbthhjaf/Build/Intermediates/ArchiveIntermediates/WebIdeCompanion/IntermediateBuildFilesPath/CordovaLib.build/Debug-iphoneos/CordovaLib.build/Objects-normal/arm64/CDVCommandQueue.o
      
      CompileC /Users/sai/Library/Developer/Xcode/DerivedData/WebIdeCompanion-fyhbmpphzqelbccgxdymhbthhjaf/Build/Intermediates/ArchiveIntermediates/WebIdeCompanion/IntermediateBuildFilesPath/CordovaLib.build/Debug-iphoneos/CordovaLib.build/Objects-normal/arm64/CDVPluginResult.o Classes/Public/CDVPluginResult.m normal arm64 objective-c com.apple.compilers.llvm.clang.1_0.compiler
      
          cd /Users/sai/Downloads/tsk/SAP_HAT_local-1.27.4/WebIdeCompanion/companionapp/CompanionApp/platforms/ios/CordovaLib
      
          export LANG=en_US.US-ASCII
      
          export PATH="/Users/sai/Downloads/Xcode.app/Contents/Developer/Platforms/iPhoneOS.platform/Developer/usr/bin:/Users/sai/Downloads/Xcode.app/Contents/Developer/usr/bin:/usr/local/bin:/usr/bin:/bin:/usr/sbin:/sbin:/usr/local/bin/ant"
      
          /Users/sai/Downloads/Xcode.app/Contents/Developer/Toolchains/XcodeDefault.xctoolchain/usr/bin/clang -x objective-c -arch arm64 -fmessage-length=0 -fdiagnostics-show-note-include-stack -fmacro-backtrace-limit=0 -std=c99 -fobjc-arc -fmodules -fmodules-cache-path=/Users/sai/Library/Developer/Xcode/DerivedData/ModuleCache -fmodules-prune-interval=86400 -fmodules-prune-after=345600 -fbuild-session-file=/Users/sai/Library/Developer/Xcode/DerivedData/ModuleCache/Session.modulevalidation -fmodules-validate-once-per-build-session -Wno-trigraphs -fpascal-strings -O0 -Wno-missing-field-initializers -Wno-missing-prototypes -Wno-implicit-atomic-properties -Wno-arc-repeated-use-of-weak -Wduplicate-method-match -Wno-missing-braces -Wparentheses -Wswitch -Wunused-function -Wno-unused-label -Wno-unused-parameter -Wunused-variable -Wunused-value -Wempty-body -Wuninitialized -Wno-unknown-pragmas -Wno-shadow -Wno-four-char-constants -Wno-conversion -Wconstant-conversion -Wint-conversion -Wbool-conversion -Wenum-conversion -Wshorten-64-to-32 -Wpointer-sign -Wno-newline-eof -Wno-selector -Wno-strict-selector-match -Wundeclared-selector -Wno-deprecated-implementations -DDEBUG=1 -isysroot /Users/sai/Downloads/Xcode.app/Contents/Developer/Platforms/iPhoneOS.platform/Developer/SDKs/iPhoneOS10.2.sdk -fstrict-aliasing -Wprotocol -Wdeprecated-declarations -miphoneos-version-min=8.0 -g -Wno-sign-conversion -Wno-infinite-recursion -iquote /Users/sai/Library/Developer/Xcode/DerivedData/WebIdeCompanion-fyhbmpphzqelbccgxdymhbthhjaf/Build/Intermediates/ArchiveIntermediates/WebIdeCompanion/IntermediateBuildFilesPath/CordovaLib.build/Debug-iphoneos/CordovaLib.build/Cordova-generated-files.hmap -I/Users/sai/Library/Developer/Xcode/DerivedData/WebIdeCompanion-fyhbmpphzqelbccgxdymhbthhjaf/Build/Intermediates/ArchiveIntermediates/WebIdeCompanion/IntermediateBuildFilesPath/CordovaLib.build/Debug-iphoneos/CordovaLib.build/Cordova-own-target-headers.hmap -I/Users/sai/Library/Developer/Xcode/DerivedData/WebIdeCompanion-fyhbmpphzqelbccgxdymhbthhjaf/Build/Intermediates/ArchiveIntermediates/WebIdeCompanion/IntermediateBuildFilesPath/CordovaLib.build/Debug-iphoneos/CordovaLib.build/Cordova-all-target-headers.hmap -iquote /Users/sai/Library/Developer/Xcode/DerivedData/WebIdeCompanion-fyhbmpphzqelbccgxdymhbthhjaf/Build/Intermediates/ArchiveIntermediates/WebIdeCompanion/IntermediateBuildFilesPath/CordovaLib.build/Debug-iphoneos/CordovaLib.build/Cordova-project-headers.hmap -I/Users/sai/Downloads/tsk/SAP_HAT_local-1.27.4/WebIdeCompanion/companionapp/CompanionApp/platforms/ios/build/device/include -I/Users/sai/Library/Developer/Xcode/DerivedData/WebIdeCompanion-fyhbmpphzqelbccgxdymhbthhjaf/Build/Intermediates/ArchiveIntermediates/WebIdeCompanion/IntermediateBuildFilesPath/UninstalledProducts/iphoneos/usr/local/lib/include -I/Users/sai/Library/Developer/Xcode/DerivedData/WebIdeCompanion-fyhbmpphzqelbccgxdymhbthhjaf/Build/Intermediates/ArchiveIntermediates/WebIdeCompanion/IntermediateBuildFilesPath/UninstalledProducts/include -I/Users/sai/Library/Developer/Xcode/DerivedData/WebIdeCompanion-fyhbmpphzqelbccgxdymhbthhjaf/Build/Intermediates/ArchiveIntermediates/WebIdeCompanion/IntermediateBuildFilesPath/UninstalledProducts/iphoneos/include -I/Users/sai/Downloads/tsk/SAP_HAT_local-1.27.4/WebIdeCompanion/companionapp/CompanionApp/platforms/ios/build/device -I/Users/sai/Library/Developer/Xcode/DerivedData/WebIdeCompanion-fyhbmpphzqelbccgxdymhbthhjaf/Build/Intermediates/ArchiveIntermediates/WebIdeCompanion/IntermediateBuildFilesPath/CordovaLib.build/Debug-iphoneos/CordovaLib.build/DerivedSources/arm64 -I/Users/sai/Library/Developer/Xcode/DerivedData/WebIdeCompanion-fyhbmpphzqelbccgxdymhbthhjaf/Build/Intermediates/ArchiveIntermediates/WebIdeCompanion/IntermediateBuildFilesPath/CordovaLib.build/Debug-iphoneos/CordovaLib.build/DerivedSources -F/Users/sai/Downloads/tsk/SAP_HAT_local-1.27.4/WebIdeCompanion/companionapp/CompanionApp/platforms/ios/build/device -DDEBUG -include /Users/sai/Downloads/tsk/SAP_HAT_local-1.27.4/WebIdeCompanion/companionapp/CompanionApp/platforms/ios/build/sharedpch/CordovaLib_Prefix-finwdtoeujlxeielzffdkjrwtuqr/CordovaLib_Prefix.pch -MMD -MT dependencies -MF /Users/sai/Library/Developer/Xcode/DerivedData/WebIdeCompanion-fyhbmpphzqelbccgxdymhbthhjaf/Build/Intermediates/ArchiveIntermediates/WebIdeCompanion/IntermediateBuildFilesPath/CordovaLib.build/Debug-iphoneos/CordovaLib.build/Objects-normal/arm64/CDVPluginResult.d --serialize-diagnostics /Users/sai/Library/Developer/Xcode/DerivedData/WebIdeCompanion-fyhbmpphzqelbccgxdymhbthhjaf/Build/Intermediates/ArchiveIntermediates/WebIdeCompanion/IntermediateBuildFilesPath/CordovaLib.build/Debug-iphoneos/CordovaLib.build/Objects-normal/arm64/CDVPluginResult.dia -c /Users/sai/Downloads/tsk/SAP_HAT_local-1.27.4/WebIdeCompanion/companionapp/CompanionApp/platforms/ios/CordovaLib/Classes/Public/CDVPluginResult.m -o /Users/sai/Library/Developer/Xcode/DerivedData/WebIdeCompanion-fyhbmpphzqelbccgxdymhbthhjaf/Build/Intermediates/ArchiveIntermediates/WebIdeCompanion/IntermediateBuildFilesPath/CordovaLib.build/Debug-iphoneos/CordovaLib.build/Objects-normal/arm64/CDVPluginResult.o
      
      CompileC /Users/sai/Library/Developer/Xcode/DerivedData/WebIdeCompanion-fyhbmpphzqelbccgxdymhbthhjaf/Build/Intermediates/ArchiveIntermediates/WebIdeCompanion/IntermediateBuildFilesPath/CordovaLib.build/Debug-iphoneos/CordovaLib.build/Objects-normal/arm64/CDVPlugin+Resources.o Classes/Public/CDVPlugin+Resources.m normal arm64 objective-c com.apple.compilers.llvm.clang.1_0.compiler
      
          cd /Users/sai/Downloads/tsk/SAP_HAT_local-1.27.4/WebIdeCompanion/companionapp/CompanionApp/platforms/ios/CordovaLib
      
          export LANG=en_US.US-ASCII
      
          export PATH="/Users/sai/Downloads/Xcode.app/Contents/Developer/Platforms/iPhoneOS.platform/Developer/usr/bin:/Users/sai/Downloads/Xcode.app/Contents/Developer/usr/bin:/usr/local/bin:/usr/bin:/bin:/usr/sbin:/sbin:/usr/local/bin/ant"
      
          /Users/sai/Downloads/Xcode.app/Contents/Developer/Toolchains/XcodeDefault.xctoolchain/usr/bin/clang -x objective-c -arch arm64 -fmessage-length=0 -fdiagnostics-show-note-include-stack -fmacro-backtrace-limit=0 -std=c99 -fobjc-arc -fmodules -fmodules-cache-path=/Users/sai/Library/Developer/Xcode/DerivedData/ModuleCache -fmodules-prune-interval=86400 -fmodules-prune-after=345600 -fbuild-session-file=/Users/sai/Library/Developer/Xcode/DerivedData/ModuleCache/Session.modulevalidation -fmodules-validate-once-per-build-session -Wno-trigraphs -fpascal-strings -O0 -Wno-missing-field-initializers -Wno-missing-prototypes -Wno-implicit-atomic-properties -Wno-arc-repeated-use-of-weak -Wduplicate-method-match -Wno-missing-braces -Wparentheses -Wswitch -Wunused-function -Wno-unused-label -Wno-unused-parameter -Wunused-variable -Wunused-value -Wempty-body -Wuninitialized -Wno-unknown-pragmas -Wno-shadow -Wno-four-char-constants -Wno-conversion -Wconstant-conversion -Wint-conversion -Wbool-conversion -Wenum-conversion -Wshorten-64-to-32 -Wpointer-sign -Wno-newline-eof -Wno-selector -Wno-strict-selector-match -Wundeclared-selector -Wno-deprecated-implementations -DDEBUG=1 -isysroot /Users/sai/Downloads/Xcode.app/Contents/Developer/Platforms/iPhoneOS.platform/Developer/SDKs/iPhoneOS10.2.sdk -fstrict-aliasing -Wprotocol -Wdeprecated-declarations -miphoneos-version-min=8.0 -g -Wno-sign-conversion -Wno-infinite-recursion -iquote /Users/sai/Library/Developer/Xcode/DerivedData/WebIdeCompanion-fyhbmpphzqelbccgxdymhbthhjaf/Build/Intermediates/ArchiveIntermediates/WebIdeCompanion/IntermediateBuildFilesPath/CordovaLib.build/Debug-iphoneos/CordovaLib.build/Cordova-generated-files.hmap -I/Users/sai/Library/Developer/Xcode/DerivedData/WebIdeCompanion-fyhbmpphzqelbccgxdymhbthhjaf/Build/Intermediates/ArchiveIntermediates/WebIdeCompanion/IntermediateBuildFilesPath/CordovaLib.build/Debug-iphoneos/CordovaLib.build/Cordova-own-target-headers.hmap -I/Users/sai/Library/Developer/Xcode/DerivedData/WebIdeCompanion-fyhbmpphzqelbccgxdymhbthhjaf/Build/Intermediates/ArchiveIntermediates/WebIdeCompanion/IntermediateBuildFilesPath/CordovaLib.build/Debug-iphoneos/CordovaLib.build/Cordova-all-target-headers.hmap -iquote /Users/sai/Library/Developer/Xcode/DerivedData/WebIdeCompanion-fyhbmpphzqelbccgxdymhbthhjaf/Build/Intermediates/ArchiveIntermediates/WebIdeCompanion/IntermediateBuildFilesPath/CordovaLib.build/Debug-iphoneos/CordovaLib.build/Cordova-project-headers.hmap -I/Users/sai/Downloads/tsk/SAP_HAT_local-1.27.4/WebIdeCompanion/companionapp/CompanionApp/platforms/ios/build/device/include -I/Users/sai/Library/Developer/Xcode/DerivedData/WebIdeCompanion-fyhbmpphzqelbccgxdymhbthhjaf/Build/Intermediates/ArchiveIntermediates/WebIdeCompanion/IntermediateBuildFilesPath/UninstalledProducts/iphoneos/usr/local/lib/include -I/Users/sai/Library/Developer/Xcode/DerivedData/WebIdeCompanion-fyhbmpphzqelbccgxdymhbthhjaf/Build/Intermediates/ArchiveIntermediates/WebIdeCompanion/IntermediateBuildFilesPath/UninstalledProducts/include -I/Users/sai/Library/Developer/Xcode/DerivedData/WebIdeCompanion-fyhbmpphzqelbccgxdymhbthhjaf/Build/Intermediates/ArchiveIntermediates/WebIdeCompanion/IntermediateBuildFilesPath/UninstalledProducts/iphoneos/include -I/Users/sai/Downloads/tsk/SAP_HAT_local-1.27.4/WebIdeCompanion/companionapp/CompanionApp/platforms/ios/build/device -I/Users/sai/Library/Developer/Xcode/DerivedData/WebIdeCompanion-fyhbmpphzqelbccgxdymhbthhjaf/Build/Intermediates/ArchiveIntermediates/WebIdeCompanion/IntermediateBuildFilesPath/CordovaLib.build/Debug-iphoneos/CordovaLib.build/DerivedSources/arm64 -I/Users/sai/Library/Developer/Xcode/DerivedData/WebIdeCompanion-fyhbmpphzqelbccgxdymhbthhjaf/Build/Intermediates/ArchiveIntermediates/WebIdeCompanion/IntermediateBuildFilesPath/CordovaLib.build/Debug-iphoneos/CordovaLib.build/DerivedSources -F/Users/sai/Downloads/tsk/SAP_HAT_local-1.27.4/WebIdeCompanion/companionapp/CompanionApp/platforms/ios/build/device -DDEBUG -include /Users/sai/Downloads/tsk/SAP_HAT_local-1.27.4/WebIdeCompanion/companionapp/CompanionApp/platforms/ios/build/sharedpch/CordovaLib_Prefix-finwdtoeujlxeielzffdkjrwtuqr/CordovaLib_Prefix.pch -MMD -MT dependencies -MF /Users/sai/Library/Developer/Xcode/DerivedData/WebIdeCompanion-fyhbmpphzqelbccgxdymhbthhjaf/Build/Intermediates/ArchiveIntermediates/WebIdeCompanion/IntermediateBuildFilesPath/CordovaLib.build/Debug-iphoneos/CordovaLib.build/Objects-normal/arm64/CDVPlugin+Resources.d --serialize-diagnostics /Users/sai/Library/Developer/Xcode/DerivedData/WebIdeCompanion-fyhbmpphzqelbccgxdymhbthhjaf/Build/Intermediates/ArchiveIntermediates/WebIdeCompanion/IntermediateBuildFilesPath/CordovaLib.build/Debug-iphoneos/CordovaLib.build/Objects-normal/arm64/CDVPlugin+Resources.dia -c /Users/sai/Downloads/tsk/SAP_HAT_local-1.27.4/WebIdeCompanion/companionapp/CompanionApp/platforms/ios/CordovaLib/Classes/Public/CDVPlugin+Resources.m -o /Users/sai/Library/Developer/Xcode/DerivedData/WebIdeCompanion-fyhbmpphzqelbccgxdymhbthhjaf/Build/Intermediates/ArchiveIntermediates/WebIdeCompanion/IntermediateBuildFilesPath/CordovaLib.build/Debug-iphoneos/CordovaLib.build/Objects-normal/arm64/CDVPlugin+Resources.o
      
      CompileC /Users/sai/Library/Developer/Xcode/DerivedData/WebIdeCompanion-fyhbmpphzqelbccgxdymhbthhjaf/Build/Intermediates/ArchiveIntermediates/WebIdeCompanion/IntermediateBuildFilesPath/CordovaLib.build/Debug-iphoneos/CordovaLib.build/Objects-normal/arm64/CDVURLProtocol.o Classes/Public/CDVURLProtocol.m normal arm64 objective-c com.apple.compilers.llvm.clang.1_0.compiler
      
          cd /Users/sai/Downloads/tsk/SAP_HAT_local-1.27.4/WebIdeCompanion/companionapp/CompanionApp/platforms/ios/CordovaLib
      
          export LANG=en_US.US-ASCII
      
          export PATH="/Users/sai/Downloads/Xcode.app/Contents/Developer/Platforms/iPhoneOS.platform/Developer/usr/bin:/Users/sai/Downloads/Xcode.app/Contents/Developer/usr/bin:/usr/local/bin:/usr/bin:/bin:/usr/sbin:/sbin:/usr/local/bin/ant"
      
          /Users/sai/Downloads/Xcode.app/Contents/Developer/Toolchains/XcodeDefault.xctoolchain/usr/bin/clang -x objective-c -arch arm64 -fmessage-length=0 -fdiagnostics-show-note-include-stack -fmacro-backtrace-limit=0 -std=c99 -fobjc-arc -fmodules -fmodules-cache-path=/Users/sai/Library/Developer/Xcode/DerivedData/ModuleCache -fmodules-prune-interval=86400 -fmodules-prune-after=345600 -fbuild-session-file=/Users/sai/Library/Developer/Xcode/DerivedData/ModuleCache/Session.modulevalidation -fmodules-validate-once-per-build-session -Wno-trigraphs -fpascal-strings -O0 -Wno-missing-field-initializers -Wno-missing-prototypes -Wno-implicit-atomic-properties -Wno-arc-repeated-use-of-weak -Wduplicate-method-match -Wno-missing-braces -Wparentheses -Wswitch -Wunused-function -Wno-unused-label -Wno-unused-parameter -Wunused-variable -Wunused-value -Wempty-body -Wuninitialized -Wno-unknown-pragmas -Wno-shadow -Wno-four-char-constants -Wno-conversion -Wconstant-conversion -Wint-conversion -Wbool-conversion -Wenum-conversion -Wshorten-64-to-32 -Wpointer-sign -Wno-newline-eof -Wno-selector -Wno-strict-selector-match -Wundeclared-selector -Wno-deprecated-implementations -DDEBUG=1 -isysroot /Users/sai/Downloads/Xcode.app/Contents/Developer/Platforms/iPhoneOS.platform/Developer/SDKs/iPhoneOS10.2.sdk -fstrict-aliasing -Wprotocol -Wdeprecated-declarations -miphoneos-version-min=8.0 -g -Wno-sign-conversion -Wno-infinite-recursion -iquote /Users/sai/Library/Developer/Xcode/DerivedData/WebIdeCompanion-fyhbmpphzqelbccgxdymhbthhjaf/Build/Intermediates/ArchiveIntermediates/WebIdeCompanion/IntermediateBuildFilesPath/CordovaLib.build/Debug-iphoneos/CordovaLib.build/Cordova-generated-files.hmap -I/Users/sai/Library/Developer/Xcode/DerivedData/WebIdeCompanion-fyhbmpphzqelbccgxdymhbthhjaf/Build/Intermediates/ArchiveIntermediates/WebIdeCompanion/IntermediateBuildFilesPath/CordovaLib.build/Debug-iphoneos/CordovaLib.build/Cordova-own-target-headers.hmap -I/Users/sai/Library/Developer/Xcode/DerivedData/WebIdeCompanion-fyhbmpphzqelbccgxdymhbthhjaf/Build/Intermediates/ArchiveIntermediates/WebIdeCompanion/IntermediateBuildFilesPath/CordovaLib.build/Debug-iphoneos/CordovaLib.build/Cordova-all-target-headers.hmap -iquote /Users/sai/Library/Developer/Xcode/DerivedData/WebIdeCompanion-fyhbmpphzqelbccgxdymhbthhjaf/Build/Intermediates/ArchiveIntermediates/WebIdeCompanion/IntermediateBuildFilesPath/CordovaLib.build/Debug-iphoneos/CordovaLib.build/Cordova-project-headers.hmap -I/Users/sai/Downloads/tsk/SAP_HAT_local-1.27.4/WebIdeCompanion/companionapp/CompanionApp/platforms/ios/build/device/include -I/Users/sai/Library/Developer/Xcode/DerivedData/WebIdeCompanion-fyhbmpphzqelbccgxdymhbthhjaf/Build/Intermediates/ArchiveIntermediates/WebIdeCompanion/IntermediateBuildFilesPath/UninstalledProducts/iphoneos/usr/local/lib/include -I/Users/sai/Library/Developer/Xcode/DerivedData/WebIdeCompanion-fyhbmpphzqelbccgxdymhbthhjaf/Build/Intermediates/ArchiveIntermediates/WebIdeCompanion/IntermediateBuildFilesPath/UninstalledProducts/include -I/Users/sai/Library/Developer/Xcode/DerivedData/WebIdeCompanion-fyhbmpphzqelbccgxdymhbthhjaf/Build/Intermediates/ArchiveIntermediates/WebIdeCompanion/IntermediateBuildFilesPath/UninstalledProducts/iphoneos/include -I/Users/sai/Downloads/tsk/SAP_HAT_local-1.27.4/WebIdeCompanion/companionapp/CompanionApp/platforms/ios/build/device -I/Users/sai/Library/Developer/Xcode/DerivedData/WebIdeCompanion-fyhbmpphzqelbccgxdymhbthhjaf/Build/Intermediates/ArchiveIntermediates/WebIdeCompanion/IntermediateBuildFilesPath/CordovaLib.build/Debug-iphoneos/CordovaLib.build/DerivedSources/arm64 -I/Users/sai/Library/Developer/Xcode/DerivedData/WebIdeCompanion-fyhbmpphzqelbccgxdymhbthhjaf/Build/Intermediates/ArchiveIntermediates/WebIdeCompanion/IntermediateBuildFilesPath/CordovaLib.build/Debug-iphoneos/CordovaLib.build/DerivedSources -F/Users/sai/Downloads/tsk/SAP_HAT_local-1.27.4/WebIdeCompanion/companionapp/CompanionApp/platforms/ios/build/device -DDEBUG -include /Users/sai/Downloads/tsk/SAP_HAT_local-1.27.4/WebIdeCompanion/companionapp/CompanionApp/platforms/ios/build/sharedpch/CordovaLib_Prefix-finwdtoeujlxeielzffdkjrwtuqr/CordovaLib_Prefix.pch -MMD -MT dependencies -MF /Users/sai/Library/Developer/Xcode/DerivedData/WebIdeCompanion-fyhbmpphzqelbccgxdymhbthhjaf/Build/Intermediates/ArchiveIntermediates/WebIdeCompanion/IntermediateBuildFilesPath/CordovaLib.build/Debug-iphoneos/CordovaLib.build/Objects-normal/arm64/CDVURLProtocol.d --serialize-diagnostics /Users/sai/Library/Developer/Xcode/DerivedData/WebIdeCompanion-fyhbmpphzqelbccgxdymhbthhjaf/Build/Intermediates/ArchiveIntermediates/WebIdeCompanion/IntermediateBuildFilesPath/CordovaLib.build/Debug-iphoneos/CordovaLib.build/Objects-normal/arm64/CDVURLProtocol.dia -c /Users/sai/Downloads/tsk/SAP_HAT_local-1.27.4/WebIdeCompanion/companionapp/CompanionApp/platforms/ios/CordovaLib/Classes/Public/CDVURLProtocol.m -o /Users/sai/Library/Developer/Xcode/DerivedData/WebIdeCompanion-fyhbmpphzqelbccgxdymhbthhjaf/Build/Intermediates/ArchiveIntermediates/WebIdeCompanion/IntermediateBuildFilesPath/CordovaLib.build/Debug-iphoneos/CordovaLib.build/Objects-normal/arm64/CDVURLProtocol.o
      
      CompileC /Users/sai/Library/Developer/Xcode/DerivedData/WebIdeCompanion-fyhbmpphzqelbccgxdymhbthhjaf/Build/Intermediates/ArchiveIntermediates/WebIdeCompanion/IntermediateBuildFilesPath/CordovaLib.build/Debug-iphoneos/CordovaLib.build/Objects-normal/arm64/CDVUIWebViewEngine.o Classes/Private/Plugins/CDVUIWebViewEngine/CDVUIWebViewEngine.m normal arm64 objective-c com.apple.compilers.llvm.clang.1_0.compiler
      
          cd /Users/sai/Downloads/tsk/SAP_HAT_local-1.27.4/WebIdeCompanion/companionapp/CompanionApp/platforms/ios/CordovaLib
      
          export LANG=en_US.US-ASCII
      
          export PATH="/Users/sai/Downloads/Xcode.app/Contents/Developer/Platforms/iPhoneOS.platform/Developer/usr/bin:/Users/sai/Downloads/Xcode.app/Contents/Developer/usr/bin:/usr/local/bin:/usr/bin:/bin:/usr/sbin:/sbin:/usr/local/bin/ant"
      
          /Users/sai/Downloads/Xcode.app/Contents/Developer/Toolchains/XcodeDefault.xctoolchain/usr/bin/clang -x objective-c -arch arm64 -fmessage-length=0 -fdiagnostics-show-note-include-stack -fmacro-backtrace-limit=0 -std=c99 -fobjc-arc -fmodules -fmodules-cache-path=/Users/sai/Library/Developer/Xcode/DerivedData/ModuleCache -fmodules-prune-interval=86400 -fmodules-prune-after=345600 -fbuild-session-file=/Users/sai/Library/Developer/Xcode/DerivedData/ModuleCache/Session.modulevalidation -fmodules-validate-once-per-build-session -Wno-trigraphs -fpascal-strings -O0 -Wno-missing-field-initializers -Wno-missing-prototypes -Wno-implicit-atomic-properties -Wno-arc-repeated-use-of-weak -Wduplicate-method-match -Wno-missing-braces -Wparentheses -Wswitch -Wunused-function -Wno-unused-label -Wno-unused-parameter -Wunused-variable -Wunused-value -Wempty-body -Wuninitialized -Wno-unknown-pragmas -Wno-shadow -Wno-four-char-constants -Wno-conversion -Wconstant-conversion -Wint-conversion -Wbool-conversion -Wenum-conversion -Wshorten-64-to-32 -Wpointer-sign -Wno-newline-eof -Wno-selector -Wno-strict-selector-match -Wundeclared-selector -Wno-deprecated-implementations -DDEBUG=1 -isysroot /Users/sai/Downloads/Xcode.app/Contents/Developer/Platforms/iPhoneOS.platform/Developer/SDKs/iPhoneOS10.2.sdk -fstrict-aliasing -Wprotocol -Wdeprecated-declarations -miphoneos-version-min=8.0 -g -Wno-sign-conversion -Wno-infinite-recursion -iquote /Users/sai/Library/Developer/Xcode/DerivedData/WebIdeCompanion-fyhbmpphzqelbccgxdymhbthhjaf/Build/Intermediates/ArchiveIntermediates/WebIdeCompanion/IntermediateBuildFilesPath/CordovaLib.build/Debug-iphoneos/CordovaLib.build/Cordova-generated-files.hmap -I/Users/sai/Library/Developer/Xcode/DerivedData/WebIdeCompanion-fyhbmpphzqelbccgxdymhbthhjaf/Build/Intermediates/ArchiveIntermediates/WebIdeCompanion/IntermediateBuildFilesPath/CordovaLib.build/Debug-iphoneos/CordovaLib.build/Cordova-own-target-headers.hmap -I/Users/sai/Library/Developer/Xcode/DerivedData/WebIdeCompanion-fyhbmpphzqelbccgxdymhbthhjaf/Build/Intermediates/ArchiveIntermediates/WebIdeCompanion/IntermediateBuildFilesPath/CordovaLib.build/Debug-iphoneos/CordovaLib.build/Cordova-all-target-headers.hmap -iquote /Users/sai/Library/Developer/Xcode/DerivedData/WebIdeCompanion-fyhbmpphzqelbccgxdymhbthhjaf/Build/Intermediates/ArchiveIntermediates/WebIdeCompanion/IntermediateBuildFilesPath/CordovaLib.build/Debug-iphoneos/CordovaLib.build/Cordova-project-headers.hmap -I/Users/sai/Downloads/tsk/SAP_HAT_local-1.27.4/WebIdeCompanion/companionapp/CompanionApp/platforms/ios/build/device/include -I/Users/sai/Library/Developer/Xcode/DerivedData/WebIdeCompanion-fyhbmpphzqelbccgxdymhbthhjaf/Build/Intermediates/ArchiveIntermediates/WebIdeCompanion/IntermediateBuildFilesPath/UninstalledProducts/iphoneos/usr/local/lib/include -I/Users/sai/Library/Developer/Xcode/DerivedData/WebIdeCompanion-fyhbmpphzqelbccgxdymhbthhjaf/Build/Intermediates/ArchiveIntermediates/WebIdeCompanion/IntermediateBuildFilesPath/UninstalledProducts/include -I/Users/sai/Library/Developer/Xcode/DerivedData/WebIdeCompanion-fyhbmpphzqelbccgxdymhbthhjaf/Build/Intermediates/ArchiveIntermediates/WebIdeCompanion/IntermediateBuildFilesPath/UninstalledProducts/iphoneos/include -I/Users/sai/Downloads/tsk/SAP_HAT_local-1.27.4/WebIdeCompanion/companionapp/CompanionApp/platforms/ios/build/device -I/Users/sai/Library/Developer/Xcode/DerivedData/WebIdeCompanion-fyhbmpphzqelbccgxdymhbthhjaf/Build/Intermediates/ArchiveIntermediates/WebIdeCompanion/IntermediateBuildFilesPath/CordovaLib.build/Debug-iphoneos/CordovaLib.build/DerivedSources/arm64 -I/Users/sai/Library/Developer/Xcode/DerivedData/WebIdeCompanion-fyhbmpphzqelbccgxdymhbthhjaf/Build/Intermediates/ArchiveIntermediates/WebIdeCompanion/IntermediateBuildFilesPath/CordovaLib.build/Debug-iphoneos/CordovaLib.build/DerivedSources -F/Users/sai/Downloads/tsk/SAP_HAT_local-1.27.4/WebIdeCompanion/companionapp/CompanionApp/platforms/ios/build/device -DDEBUG -include /Users/sai/Downloads/tsk/SAP_HAT_local-1.27.4/WebIdeCompanion/companionapp/CompanionApp/platforms/ios/build/sharedpch/CordovaLib_Prefix-finwdtoeujlxeielzffdkjrwtuqr/CordovaLib_Prefix.pch -MMD -MT dependencies -MF /Users/sai/Library/Developer/Xcode/DerivedData/WebIdeCompanion-fyhbmpphzqelbccgxdymhbthhjaf/Build/Intermediates/ArchiveIntermediates/WebIdeCompanion/IntermediateBuildFilesPath/CordovaLib.build/Debug-iphoneos/CordovaLib.build/Objects-normal/arm64/CDVUIWebViewEngine.d --serialize-diagnostics /Users/sai/Library/Developer/Xcode/DerivedData/WebIdeCompanion-fyhbmpphzqelbccgxdymhbthhjaf/Build/Intermediates/ArchiveIntermediates/WebIdeCompanion/IntermediateBuildFilesPath/CordovaLib.build/Debug-iphoneos/CordovaLib.build/Objects-normal/arm64/CDVUIWebViewEngine.dia -c /Users/sai/Downloads/tsk/SAP_HAT_local-1.27.4/WebIdeCompanion/companionapp/CompanionApp/platforms/ios/CordovaLib/Classes/Private/Plugins/CDVUIWebViewEngine/CDVUIWebViewEngine.m -o /Users/sai/Library/Developer/Xcode/DerivedData/WebIdeCompanion-fyhbmpphzqelbccgxdymhbthhjaf/Build/Intermediates/ArchiveIntermediates/WebIdeCompanion/IntermediateBuildFilesPath/CordovaLib.build/Debug-iphoneos/CordovaLib.build/Objects-normal/arm64/CDVUIWebViewEngine.o
      
      CompileC /Users/sai/Library/Developer/Xcode/DerivedData/WebIdeCompanion-fyhbmpphzqelbccgxdymhbthhjaf/Build/Intermediates/ArchiveIntermediates/WebIdeCompanion/IntermediateBuildFilesPath/CordovaLib.build/Debug-iphoneos/CordovaLib.build/Objects-normal/arm64/CDVPlugin.o Classes/Public/CDVPlugin.m normal arm64 objective-c com.apple.compilers.llvm.clang.1_0.compiler
      
          cd /Users/sai/Downloads/tsk/SAP_HAT_local-1.27.4/WebIdeCompanion/companionapp/CompanionApp/platforms/ios/CordovaLib
      
          export LANG=en_US.US-ASCII
      
          export PATH="/Users/sai/Downloads/Xcode.app/Contents/Developer/Platforms/iPhoneOS.platform/Developer/usr/bin:/Users/sai/Downloads/Xcode.app/Contents/Developer/usr/bin:/usr/local/bin:/usr/bin:/bin:/usr/sbin:/sbin:/usr/local/bin/ant"
      
          /Users/sai/Downloads/Xcode.app/Contents/Developer/Toolchains/XcodeDefault.xctoolchain/usr/bin/clang -x objective-c -arch arm64 -fmessage-length=0 -fdiagnostics-show-note-include-stack -fmacro-backtrace-limit=0 -std=c99 -fobjc-arc -fmodules -fmodules-cache-path=/Users/sai/Library/Developer/Xcode/DerivedData/ModuleCache -fmodules-prune-interval=86400 -fmodules-prune-after=345600 -fbuild-session-file=/Users/sai/Library/Developer/Xcode/DerivedData/ModuleCache/Session.modulevalidation -fmodules-validate-once-per-build-session -Wno-trigraphs -fpascal-strings -O0 -Wno-missing-field-initializers -Wno-missing-prototypes -Wno-implicit-atomic-properties -Wno-arc-repeated-use-of-weak -Wduplicate-method-match -Wno-missing-braces -Wparentheses -Wswitch -Wunused-function -Wno-unused-label -Wno-unused-parameter -Wunused-variable -Wunused-value -Wempty-body -Wuninitialized -Wno-unknown-pragmas -Wno-shadow -Wno-four-char-constants -Wno-conversion -Wconstant-conversion -Wint-conversion -Wbool-conversion -Wenum-conversion -Wshorten-64-to-32 -Wpointer-sign -Wno-newline-eof -Wno-selector -Wno-strict-selector-match -Wundeclared-selector -Wno-deprecated-implementations -DDEBUG=1 -isysroot /Users/sai/Downloads/Xcode.app/Contents/Developer/Platforms/iPhoneOS.platform/Developer/SDKs/iPhoneOS10.2.sdk -fstrict-aliasing -Wprotocol -Wdeprecated-declarations -miphoneos-version-min=8.0 -g -Wno-sign-conversion -Wno-infinite-recursion -iquote /Users/sai/Library/Developer/Xcode/DerivedData/WebIdeCompanion-fyhbmpphzqelbccgxdymhbthhjaf/Build/Intermediates/ArchiveIntermediates/WebIdeCompanion/IntermediateBuildFilesPath/CordovaLib.build/Debug-iphoneos/CordovaLib.build/Cordova-generated-files.hmap -I/Users/sai/Library/Developer/Xcode/DerivedData/WebIdeCompanion-fyhbmpphzqelbccgxdymhbthhjaf/Build/Intermediates/ArchiveIntermediates/WebIdeCompanion/IntermediateBuildFilesPath/CordovaLib.build/Debug-iphoneos/CordovaLib.build/Cordova-own-target-headers.hmap -I/Users/sai/Library/Developer/Xcode/DerivedData/WebIdeCompanion-fyhbmpphzqelbccgxdymhbthhjaf/Build/Intermediates/ArchiveIntermediates/WebIdeCompanion/IntermediateBuildFilesPath/CordovaLib.build/Debug-iphoneos/CordovaLib.build/Cordova-all-target-headers.hmap -iquote /Users/sai/Library/Developer/Xcode/DerivedData/WebIdeCompanion-fyhbmpphzqelbccgxdymhbthhjaf/Build/Intermediates/ArchiveIntermediates/WebIdeCompanion/IntermediateBuildFilesPath/CordovaLib.build/Debug-iphoneos/CordovaLib.build/Cordova-project-headers.hmap -I/Users/sai/Downloads/tsk/SAP_HAT_local-1.27.4/WebIdeCompanion/companionapp/CompanionApp/platforms/ios/build/device/include -I/Users/sai/Library/Developer/Xcode/DerivedData/WebIdeCompanion-fyhbmpphzqelbccgxdymhbthhjaf/Build/Intermediates/ArchiveIntermediates/WebIdeCompanion/IntermediateBuildFilesPath/UninstalledProducts/iphoneos/usr/local/lib/include -I/Users/sai/Library/Developer/Xcode/DerivedData/WebIdeCompanion-fyhbmpphzqelbccgxdymhbthhjaf/Build/Intermediates/ArchiveIntermediates/WebIdeCompanion/IntermediateBuildFilesPath/UninstalledProducts/include -I/Users/sai/Library/Developer/Xcode/DerivedData/WebIdeCompanion-fyhbmpphzqelbccgxdymhbthhjaf/Build/Intermediates/ArchiveIntermediates/WebIdeCompanion/IntermediateBuildFilesPath/UninstalledProducts/iphoneos/include -I/Users/sai/Downloads/tsk/SAP_HAT_local-1.27.4/WebIdeCompanion/companionapp/CompanionApp/platforms/ios/build/device -I/Users/sai/Library/Developer/Xcode/DerivedData/WebIdeCompanion-fyhbmpphzqelbccgxdymhbthhjaf/Build/Intermediates/ArchiveIntermediates/WebIdeCompanion/IntermediateBuildFilesPath/CordovaLib.build/Debug-iphoneos/CordovaLib.build/DerivedSources/arm64 -I/Users/sai/Library/Developer/Xcode/DerivedData/WebIdeCompanion-fyhbmpphzqelbccgxdymhbthhjaf/Build/Intermediates/ArchiveIntermediates/WebIdeCompanion/IntermediateBuildFilesPath/CordovaLib.build/Debug-iphoneos/CordovaLib.build/DerivedSources -F/Users/sai/Downloads/tsk/SAP_HAT_local-1.27.4/WebIdeCompanion/companionapp/CompanionApp/platforms/ios/build/device -DDEBUG -include /Users/sai/Downloads/tsk/SAP_HAT_local-1.27.4/WebIdeCompanion/companionapp/CompanionApp/platforms/ios/build/sharedpch/CordovaLib_Prefix-finwdtoeujlxeielzffdkjrwtuqr/CordovaLib_Prefix.pch -MMD -MT dependencies -MF /Users/sai/Library/Developer/Xcode/DerivedData/WebIdeCompanion-fyhbmpphzqelbccgxdymhbthhjaf/Build/Intermediates/ArchiveIntermediates/WebIdeCompanion/IntermediateBuildFilesPath/CordovaLib.build/Debug-iphoneos/CordovaLib.build/Objects-normal/arm64/CDVPlugin.d --serialize-diagnostics /Users/sai/Library/Developer/Xcode/DerivedData/WebIdeCompanion-fyhbmpphzqelbccgxdymhbthhjaf/Build/Intermediates/ArchiveIntermediates/WebIdeCompanion/IntermediateBuildFilesPath/CordovaLib.build/Debug-iphoneos/CordovaLib.build/Objects-normal/arm64/CDVPlugin.dia -c /Users/sai/Downloads/tsk/SAP_HAT_local-1.27.4/WebIdeCompanion/companionapp/CompanionApp/platforms/ios/CordovaLib/Classes/Public/CDVPlugin.m -o /Users/sai/Library/Developer/Xcode/DerivedData/WebIdeCompanion-fyhbmpphzqelbccgxdymhbthhjaf/Build/Intermediates/ArchiveIntermediates/WebIdeCompanion/IntermediateBuildFilesPath/CordovaLib.build/Debug-iphoneos/CordovaLib.build/Objects-normal/arm64/CDVPlugin.o
      
      CompileC /Users/sai/Library/Developer/Xcode/DerivedData/WebIdeCompanion-fyhbmpphzqelbccgxdymhbthhjaf/Build/Intermediates/ArchiveIntermediates/WebIdeCompanion/IntermediateBuildFilesPath/CordovaLib.build/Debug-iphoneos/CordovaLib.build/Objects-normal/arm64/CDVLocalStorage.o Classes/Private/Plugins/CDVLocalStorage/CDVLocalStorage.m normal arm64 objective-c com.apple.compilers.llvm.clang.1_0.compiler
      
          cd /Users/sai/Downloads/tsk/SAP_HAT_local-1.27.4/WebIdeCompanion/companionapp/CompanionApp/platforms/ios/CordovaLib
      
          export LANG=en_US.US-ASCII
      
          export PATH="/Users/sai/Downloads/Xcode.app/Contents/Developer/Platforms/iPhoneOS.platform/Developer/usr/bin:/Users/sai/Downloads/Xcode.app/Contents/Developer/usr/bin:/usr/local/bin:/usr/bin:/bin:/usr/sbin:/sbin:/usr/local/bin/ant"
      
          /Users/sai/Downloads/Xcode.app/Contents/Developer/Toolchains/XcodeDefault.xctoolchain/usr/bin/clang -x objective-c -arch arm64 -fmessage-length=0 -fdiagnostics-show-note-include-stack -fmacro-backtrace-limit=0 -std=c99 -fobjc-arc -fmodules -fmodules-cache-path=/Users/sai/Library/Developer/Xcode/DerivedData/ModuleCache -fmodules-prune-interval=86400 -fmodules-prune-after=345600 -fbuild-session-file=/Users/sai/Library/Developer/Xcode/DerivedData/ModuleCache/Session.modulevalidation -fmodules-validate-once-per-build-session -Wno-trigraphs -fpascal-strings -O0 -Wno-missing-field-initializers -Wno-missing-prototypes -Wno-implicit-atomic-properties -Wno-arc-repeated-use-of-weak -Wduplicate-method-match -Wno-missing-braces -Wparentheses -Wswitch -Wunused-function -Wno-unused-label -Wno-unused-parameter -Wunused-variable -Wunused-value -Wempty-body -Wuninitialized -Wno-unknown-pragmas -Wno-shadow -Wno-four-char-constants -Wno-conversion -Wconstant-conversion -Wint-conversion -Wbool-conversion -Wenum-conversion -Wshorten-64-to-32 -Wpointer-sign -Wno-newline-eof -Wno-selector -Wno-strict-selector-match -Wundeclared-selector -Wno-deprecated-implementations -DDEBUG=1 -isysroot /Users/sai/Downloads/Xcode.app/Contents/Developer/Platforms/iPhoneOS.platform/Developer/SDKs/iPhoneOS10.2.sdk -fstrict-aliasing -Wprotocol -Wdeprecated-declarations -miphoneos-version-min=8.0 -g -Wno-sign-conversion -Wno-infinite-recursion -iquote /Users/sai/Library/Developer/Xcode/DerivedData/WebIdeCompanion-fyhbmpphzqelbccgxdymhbthhjaf/Build/Intermediates/ArchiveIntermediates/WebIdeCompanion/IntermediateBuildFilesPath/CordovaLib.build/Debug-iphoneos/CordovaLib.build/Cordova-generated-files.hmap -I/Users/sai/Library/Developer/Xcode/DerivedData/WebIdeCompanion-fyhbmpphzqelbccgxdymhbthhjaf/Build/Intermediates/ArchiveIntermediates/WebIdeCompanion/IntermediateBuildFilesPath/CordovaLib.build/Debug-iphoneos/CordovaLib.build/Cordova-own-target-headers.hmap -I/Users/sai/Library/Developer/Xcode/DerivedData/WebIdeCompanion-fyhbmpphzqelbccgxdymhbthhjaf/Build/Intermediates/ArchiveIntermediates/WebIdeCompanion/IntermediateBuildFilesPath/CordovaLib.build/Debug-iphoneos/CordovaLib.build/Cordova-all-target-headers.hmap -iquote /Users/sai/Library/Developer/Xcode/DerivedData/WebIdeCompanion-fyhbmpphzqelbccgxdymhbthhjaf/Build/Intermediates/ArchiveIntermediates/WebIdeCompanion/IntermediateBuildFilesPath/CordovaLib.build/Debug-iphoneos/CordovaLib.build/Cordova-project-headers.hmap -I/Users/sai/Downloads/tsk/SAP_HAT_local-1.27.4/WebIdeCompanion/companionapp/CompanionApp/platforms/ios/build/device/include -I/Users/sai/Library/Developer/Xcode/DerivedData/WebIdeCompanion-fyhbmpphzqelbccgxdymhbthhjaf/Build/Intermediates/ArchiveIntermediates/WebIdeCompanion/IntermediateBuildFilesPath/UninstalledProducts/iphoneos/usr/local/lib/include -I/Users/sai/Library/Developer/Xcode/DerivedData/WebIdeCompanion-fyhbmpphzqelbccgxdymhbthhjaf/Build/Intermediates/ArchiveIntermediates/WebIdeCompanion/IntermediateBuildFilesPath/UninstalledProducts/include -I/Users/sai/Library/Developer/Xcode/DerivedData/WebIdeCompanion-fyhbmpphzqelbccgxdymhbthhjaf/Build/Intermediates/ArchiveIntermediates/WebIdeCompanion/IntermediateBuildFilesPath/UninstalledProducts/iphoneos/include -I/Users/sai/Downloads/tsk/SAP_HAT_local-1.27.4/WebIdeCompanion/companionapp/CompanionApp/platforms/ios/build/device -I/Users/sai/Library/Developer/Xcode/DerivedData/WebIdeCompanion-fyhbmpphzqelbccgxdymhbthhjaf/Build/Intermediates/ArchiveIntermediates/WebIdeCompanion/IntermediateBuildFilesPath/CordovaLib.build/Debug-iphoneos/CordovaLib.build/DerivedSources/arm64 -I/Users/sai/Library/Developer/Xcode/DerivedData/WebIdeCompanion-fyhbmpphzqelbccgxdymhbthhjaf/Build/Intermediates/ArchiveIntermediates/WebIdeCompanion/IntermediateBuildFilesPath/CordovaLib.build/Debug-iphoneos/CordovaLib.build/DerivedSources -F/Users/sai/Downloads/tsk/SAP_HAT_local-1.27.4/WebIdeCompanion/companionapp/CompanionApp/platforms/ios/build/device -DDEBUG -include /Users/sai/Downloads/tsk/SAP_HAT_local-1.27.4/WebIdeCompanion/companionapp/CompanionApp/platforms/ios/build/sharedpch/CordovaLib_Prefix-finwdtoeujlxeielzffdkjrwtuqr/CordovaLib_Prefix.pch -MMD -MT dependencies -MF /Users/sai/Library/Developer/Xcode/DerivedData/WebIdeCompanion-fyhbmpphzqelbccgxdymhbthhjaf/Build/Intermediates/ArchiveIntermediates/WebIdeCompanion/IntermediateBuildFilesPath/CordovaLib.build/Debug-iphoneos/CordovaLib.build/Objects-normal/arm64/CDVLocalStorage.d --serialize-diagnostics /Users/sai/Library/Developer/Xcode/DerivedData/WebIdeCompanion-fyhbmpphzqelbccgxdymhbthhjaf/Build/Intermediates/ArchiveIntermediates/WebIdeCompanion/IntermediateBuildFilesPath/CordovaLib.build/Debug-iphoneos/CordovaLib.build/Objects-normal/arm64/CDVLocalStorage.dia -c /Users/sai/Downloads/tsk/SAP_HAT_local-1.27.4/WebIdeCompanion/companionapp/CompanionApp/platforms/ios/CordovaLib/Classes/Private/Plugins/CDVLocalStorage/CDVLocalStorage.m -o /Users/sai/Library/Developer/Xcode/DerivedData/WebIdeCompanion-fyhbmpphzqelbccgxdymhbthhjaf/Build/Intermediates/ArchiveIntermediates/WebIdeCompanion/IntermediateBuildFilesPath/CordovaLib.build/Debug-iphoneos/CordovaLib.build/Objects-normal/arm64/CDVLocalStorage.o
      
      CompileC /Users/sai/Library/Developer/Xcode/DerivedData/WebIdeCompanion-fyhbmpphzqelbccgxdymhbthhjaf/Build/Intermediates/ArchiveIntermediates/WebIdeCompanion/IntermediateBuildFilesPath/CordovaLib.build/Debug-iphoneos/CordovaLib.build/Objects-normal/arm64/CDVIntentAndNavigationFilter.o Classes/Private/Plugins/CDVIntentAndNavigationFilter/CDVIntentAndNavigationFilter.m normal arm64 objective-c com.apple.compilers.llvm.clang.1_0.compiler
      
          cd /Users/sai/Downloads/tsk/SAP_HAT_local-1.27.4/WebIdeCompanion/companionapp/CompanionApp/platforms/ios/CordovaLib
      
          export LANG=en_US.US-ASCII
      
          export PATH="/Users/sai/Downloads/Xcode.app/Contents/Developer/Platforms/iPhoneOS.platform/Developer/usr/bin:/Users/sai/Downloads/Xcode.app/Contents/Developer/usr/bin:/usr/local/bin:/usr/bin:/bin:/usr/sbin:/sbin:/usr/local/bin/ant"
      
          /Users/sai/Downloads/Xcode.app/Contents/Developer/Toolchains/XcodeDefault.xctoolchain/usr/bin/clang -x objective-c -arch arm64 -fmessage-length=0 -fdiagnostics-show-note-include-stack -fmacro-backtrace-limit=0 -std=c99 -fobjc-arc -fmodules -fmodules-cache-path=/Users/sai/Library/Developer/Xcode/DerivedData/ModuleCache -fmodules-prune-interval=86400 -fmodules-prune-after=345600 -fbuild-session-file=/Users/sai/Library/Developer/Xcode/DerivedData/ModuleCache/Session.modulevalidation -fmodules-validate-once-per-build-session -Wno-trigraphs -fpascal-strings -O0 -Wno-missing-field-initializers -Wno-missing-prototypes -Wno-implicit-atomic-properties -Wno-arc-repeated-use-of-weak -Wduplicate-method-match -Wno-missing-braces -Wparentheses -Wswitch -Wunused-function -Wno-unused-label -Wno-unused-parameter -Wunused-variable -Wunused-value -Wempty-body -Wuninitialized -Wno-unknown-pragmas -Wno-shadow -Wno-four-char-constants -Wno-conversion -Wconstant-conversion -Wint-conversion -Wbool-conversion -Wenum-conversion -Wshorten-64-to-32 -Wpointer-sign -Wno-newline-eof -Wno-selector -Wno-strict-selector-match -Wundeclared-selector -Wno-deprecated-implementations -DDEBUG=1 -isysroot /Users/sai/Downloads/Xcode.app/Contents/Developer/Platforms/iPhoneOS.platform/Developer/SDKs/iPhoneOS10.2.sdk -fstrict-aliasing -Wprotocol -Wdeprecated-declarations -miphoneos-version-min=8.0 -g -Wno-sign-conversion -Wno-infinite-recursion -iquote /Users/sai/Library/Developer/Xcode/DerivedData/WebIdeCompanion-fyhbmpphzqelbccgxdymhbthhjaf/Build/Intermediates/ArchiveIntermediates/WebIdeCompanion/IntermediateBuildFilesPath/CordovaLib.build/Debug-iphoneos/CordovaLib.build/Cordova-generated-files.hmap -I/Users/sai/Library/Developer/Xcode/DerivedData/WebIdeCompanion-fyhbmpphzqelbccgxdymhbthhjaf/Build/Intermediates/ArchiveIntermediates/WebIdeCompanion/IntermediateBuildFilesPath/CordovaLib.build/Debug-iphoneos/CordovaLib.build/Cordova-own-target-headers.hmap -I/Users/sai/Library/Developer/Xcode/DerivedData/WebIdeCompanion-fyhbmpphzqelbccgxdymhbthhjaf/Build/Intermediates/ArchiveIntermediates/WebIdeCompanion/IntermediateBuildFilesPath/CordovaLib.build/Debug-iphoneos/CordovaLib.build/Cordova-all-target-headers.hmap -iquote /Users/sai/Library/Developer/Xcode/DerivedData/WebIdeCompanion-fyhbmpphzqelbccgxdymhbthhjaf/Build/Intermediates/ArchiveIntermediates/WebIdeCompanion/IntermediateBuildFilesPath/CordovaLib.build/Debug-iphoneos/CordovaLib.build/Cordova-project-headers.hmap -I/Users/sai/Downloads/tsk/SAP_HAT_local-1.27.4/WebIdeCompanion/companionapp/CompanionApp/platforms/ios/build/device/include -I/Users/sai/Library/Developer/Xcode/DerivedData/WebIdeCompanion-fyhbmpphzqelbccgxdymhbthhjaf/Build/Intermediates/ArchiveIntermediates/WebIdeCompanion/IntermediateBuildFilesPath/UninstalledProducts/iphoneos/usr/local/lib/include -I/Users/sai/Library/Developer/Xcode/DerivedData/WebIdeCompanion-fyhbmpphzqelbccgxdymhbthhjaf/Build/Intermediates/ArchiveIntermediates/WebIdeCompanion/IntermediateBuildFilesPath/UninstalledProducts/include -I/Users/sai/Library/Developer/Xcode/DerivedData/WebIdeCompanion-fyhbmpphzqelbccgxdymhbthhjaf/Build/Intermediates/ArchiveIntermediates/WebIdeCompanion/IntermediateBuildFilesPath/UninstalledProducts/iphoneos/include -I/Users/sai/Downloads/tsk/SAP_HAT_local-1.27.4/WebIdeCompanion/companionapp/CompanionApp/platforms/ios/build/device -I/Users/sai/Library/Developer/Xcode/DerivedData/WebIdeCompanion-fyhbmpphzqelbccgxdymhbthhjaf/Build/Intermediates/ArchiveIntermediates/WebIdeCompanion/IntermediateBuildFilesPath/CordovaLib.build/Debug-iphoneos/CordovaLib.build/DerivedSources/arm64 -I/Users/sai/Library/Developer/Xcode/DerivedData/WebIdeCompanion-fyhbmpphzqelbccgxdymhbthhjaf/Build/Intermediates/ArchiveIntermediates/WebIdeCompanion/IntermediateBuildFilesPath/CordovaLib.build/Debug-iphoneos/CordovaLib.build/DerivedSources -F/Users/sai/Downloads/tsk/SAP_HAT_local-1.27.4/WebIdeCompanion/companionapp/CompanionApp/platforms/ios/build/device -DDEBUG -include /Users/sai/Downloads/tsk/SAP_HAT_local-1.27.4/WebIdeCompanion/companionapp/CompanionApp/platforms/ios/build/sharedpch/CordovaLib_Prefix-finwdtoeujlxeielzffdkjrwtuqr/CordovaLib_Prefix.pch -MMD -MT dependencies -MF /Users/sai/Library/Developer/Xcode/DerivedData/WebIdeCompanion-fyhbmpphzqelbccgxdymhbthhjaf/Build/Intermediates/ArchiveIntermediates/WebIdeCompanion/IntermediateBuildFilesPath/CordovaLib.build/Debug-iphoneos/CordovaLib.build/Objects-normal/arm64/CDVIntentAndNavigationFilter.d --serialize-diagnostics /Users/sai/Library/Developer/Xcode/DerivedData/WebIdeCompanion-fyhbmpphzqelbccgxdymhbthhjaf/Build/Intermediates/ArchiveIntermediates/WebIdeCompanion/IntermediateBuildFilesPath/CordovaLib.build/Debug-iphoneos/CordovaLib.build/Objects-normal/arm64/CDVIntentAndNavigationFilter.dia -c /Users/sai/Downloads/tsk/SAP_HAT_local-1.27.4/WebIdeCompanion/companionapp/CompanionApp/platforms/ios/CordovaLib/Classes/Private/Plugins/CDVIntentAndNavigationFilter/CDVIntentAndNavigationFilter.m -o /Users/sai/Library/Developer/Xcode/DerivedData/WebIdeCompanion-fyhbmpphzqelbccgxdymhbthhjaf/Build/Intermediates/ArchiveIntermediates/WebIdeCompanion/IntermediateBuildFilesPath/CordovaLib.build/Debug-iphoneos/CordovaLib.build/Objects-normal/arm64/CDVIntentAndNavigationFilter.o
      
      Libtool /Users/sai/Library/Developer/Xcode/DerivedData/WebIdeCompanion-fyhbmpphzqelbccgxdymhbthhjaf/Build/Intermediates/ArchiveIntermediates/WebIdeCompanion/IntermediateBuildFilesPath/CordovaLib.build/Debug-iphoneos/CordovaLib.build/Objects-normal/armv7/libCordova.a normal armv7
      
          cd /Users/sai/Downloads/tsk/SAP_HAT_local-1.27.4/WebIdeCompanion/companionapp/CompanionApp/platforms/ios/CordovaLib
      
          export IPHONEOS_DEPLOYMENT_TARGET=8.0
      
          export PATH="/Users/sai/Downloads/Xcode.app/Contents/Developer/Platforms/iPhoneOS.platform/Developer/usr/bin:/Users/sai/Downloads/Xcode.app/Contents/Developer/usr/bin:/usr/local/bin:/usr/bin:/bin:/usr/sbin:/sbin:/usr/local/bin/ant"
      
          /Users/sai/Downloads/Xcode.app/Contents/Developer/Toolchains/XcodeDefault.xctoolchain/usr/bin/libtool -static -arch_only armv7 -syslibroot /Users/sai/Downloads/Xcode.app/Contents/Developer/Platforms/iPhoneOS.platform/Developer/SDKs/iPhoneOS10.2.sdk -L/Users/sai/Downloads/tsk/SAP_HAT_local-1.27.4/WebIdeCompanion/companionapp/CompanionApp/platforms/ios/build/device -filelist /Users/sai/Library/Developer/Xcode/DerivedData/WebIdeCompanion-fyhbmpphzqelbccgxdymhbthhjaf/Build/Intermediates/ArchiveIntermediates/WebIdeCompanion/IntermediateBuildFilesPath/CordovaLib.build/Debug-iphoneos/CordovaLib.build/Objects-normal/armv7/Cordova.LinkFileList -o /Users/sai/Library/Developer/Xcode/DerivedData/WebIdeCompanion-fyhbmpphzqelbccgxdymhbthhjaf/Build/Intermediates/ArchiveIntermediates/WebIdeCompanion/IntermediateBuildFilesPath/CordovaLib.build/Debug-iphoneos/CordovaLib.build/Objects-normal/armv7/libCordova.a
      
      Libtool /Users/sai/Library/Developer/Xcode/DerivedData/WebIdeCompanion-fyhbmpphzqelbccgxdymhbthhjaf/Build/Intermediates/ArchiveIntermediates/WebIdeCompanion/IntermediateBuildFilesPath/CordovaLib.build/Debug-iphoneos/CordovaLib.build/Objects-normal/arm64/libCordova.a normal arm64
      
          cd /Users/sai/Downloads/tsk/SAP_HAT_local-1.27.4/WebIdeCompanion/companionapp/CompanionApp/platforms/ios/CordovaLib
      
          export IPHONEOS_DEPLOYMENT_TARGET=8.0
      
          export PATH="/Users/sai/Downloads/Xcode.app/Contents/Developer/Platforms/iPhoneOS.platform/Developer/usr/bin:/Users/sai/Downloads/Xcode.app/Contents/Developer/usr/bin:/usr/local/bin:/usr/bin:/bin:/usr/sbin:/sbin:/usr/local/bin/ant"
      
          /Users/sai/Downloads/Xcode.app/Contents/Developer/Toolchains/XcodeDefault.xctoolchain/usr/bin/libtool -static -arch_only arm64 -syslibroot /Users/sai/Downloads/Xcode.app/Contents/Developer/Platforms/iPhoneOS.platform/Developer/SDKs/iPhoneOS10.2.sdk -L/Users/sai/Downloads/tsk/SAP_HAT_local-1.27.4/WebIdeCompanion/companionapp/CompanionApp/platforms/ios/build/device -filelist /Users/sai/Library/Developer/Xcode/DerivedData/WebIdeCompanion-fyhbmpphzqelbccgxdymhbthhjaf/Build/Intermediates/ArchiveIntermediates/WebIdeCompanion/IntermediateBuildFilesPath/CordovaLib.build/Debug-iphoneos/CordovaLib.build/Objects-normal/arm64/Cordova.LinkFileList -o /Users/sai/Library/Developer/Xcode/DerivedData/WebIdeCompanion-fyhbmpphzqelbccgxdymhbthhjaf/Build/Intermediates/ArchiveIntermediates/WebIdeCompanion/IntermediateBuildFilesPath/CordovaLib.build/Debug-iphoneos/CordovaLib.build/Objects-normal/arm64/libCordova.a
      
      CreateUniversalBinary /Users/sai/Library/Developer/Xcode/DerivedData/WebIdeCompanion-fyhbmpphzqelbccgxdymhbthhjaf/Build/Intermediates/ArchiveIntermediates/WebIdeCompanion/IntermediateBuildFilesPath/UninstalledProducts/iphoneos/libCordova.a normal armv7\ arm64
      
          cd /Users/sai/Downloads/tsk/SAP_HAT_local-1.27.4/WebIdeCompanion/companionapp/CompanionApp/platforms/ios/CordovaLib
      
          export PATH="/Users/sai/Downloads/Xcode.app/Contents/Developer/Platforms/iPhoneOS.platform/Developer/usr/bin:/Users/sai/Downloads/Xcode.app/Contents/Developer/usr/bin:/usr/local/bin:/usr/bin:/bin:/usr/sbin:/sbin:/usr/local/bin/ant"
      
          /Users/sai/Downloads/Xcode.app/Contents/Developer/Toolchains/XcodeDefault.xctoolchain/usr/bin/libtool -static /Users/sai/Library/Developer/Xcode/DerivedData/WebIdeCompanion-fyhbmpphzqelbccgxdymhbthhjaf/Build/Intermediates/ArchiveIntermediates/WebIdeCompanion/IntermediateBuildFilesPath/CordovaLib.build/Debug-iphoneos/CordovaLib.build/Objects-normal/armv7/libCordova.a /Users/sai/Library/Developer/Xcode/DerivedData/WebIdeCompanion-fyhbmpphzqelbccgxdymhbthhjaf/Build/Intermediates/ArchiveIntermediates/WebIdeCompanion/IntermediateBuildFilesPath/CordovaLib.build/Debug-iphoneos/CordovaLib.build/Objects-normal/arm64/libCordova.a -o /Users/sai/Library/Developer/Xcode/DerivedData/WebIdeCompanion-fyhbmpphzqelbccgxdymhbthhjaf/Build/Intermediates/ArchiveIntermediates/WebIdeCompanion/IntermediateBuildFilesPath/UninstalledProducts/iphoneos/libCordova.a
      
      Strip /Users/sai/Library/Developer/Xcode/DerivedData/WebIdeCompanion-fyhbmpphzqelbccgxdymhbthhjaf/Build/Intermediates/ArchiveIntermediates/WebIdeCompanion/IntermediateBuildFilesPath/UninstalledProducts/iphoneos/libCordova.a
      
          cd /Users/sai/Downloads/tsk/SAP_HAT_local-1.27.4/WebIdeCompanion/companionapp/CompanionApp/platforms/ios/CordovaLib
      
          export PATH="/Users/sai/Downloads/Xcode.app/Contents/Developer/Platforms/iPhoneOS.platform/Developer/usr/bin:/Users/sai/Downloads/Xcode.app/Contents/Developer/usr/bin:/usr/local/bin:/usr/bin:/bin:/usr/sbin:/sbin:/usr/local/bin/ant"
      
          /Users/sai/Downloads/Xcode.app/Contents/Developer/Toolchains/XcodeDefault.xctoolchain/usr/bin/strip -S /Users/sai/Library/Developer/Xcode/DerivedData/WebIdeCompanion-fyhbmpphzqelbccgxdymhbthhjaf/Build/Intermediates/ArchiveIntermediates/WebIdeCompanion/IntermediateBuildFilesPath/UninstalledProducts/iphoneos/libCordova.a
      
      SetOwnerAndGroup sai:staff /Users/sai/Library/Developer/Xcode/DerivedData/WebIdeCompanion-fyhbmpphzqelbccgxdymhbthhjaf/Build/Intermediates/ArchiveIntermediates/WebIdeCompanion/IntermediateBuildFilesPath/UninstalledProducts/iphoneos/libCordova.a
      
          cd /Users/sai/Downloads/tsk/SAP_HAT_local-1.27.4/WebIdeCompanion/companionapp/CompanionApp/platforms/ios/CordovaLib
      
          export PATH="/Users/sai/Downloads/Xcode.app/Contents/Developer/Platforms/iPhoneOS.platform/Developer/usr/bin:/Users/sai/Downloads/Xcode.app/Contents/Developer/usr/bin:/usr/local/bin:/usr/bin:/bin:/usr/sbin:/sbin:/usr/local/bin/ant"
      
          /usr/sbin/chown -RH sai:staff /Users/sai/Library/Developer/Xcode/DerivedData/WebIdeCompanion-fyhbmpphzqelbccgxdymhbthhjaf/Build/Intermediates/ArchiveIntermediates/WebIdeCompanion/IntermediateBuildFilesPath/UninstalledProducts/iphoneos/libCordova.a
      
      SetMode u+w,go-w,a+rX /Users/sai/Library/Developer/Xcode/DerivedData/WebIdeCompanion-fyhbmpphzqelbccgxdymhbthhjaf/Build/Intermediates/ArchiveIntermediates/WebIdeCompanion/IntermediateBuildFilesPath/UninstalledProducts/iphoneos/libCordova.a
      
          cd /Users/sai/Downloads/tsk/SAP_HAT_local-1.27.4/WebIdeCompanion/companionapp/CompanionApp/platforms/ios/CordovaLib
      
          export PATH="/Users/sai/Downloads/Xcode.app/Contents/Developer/Platforms/iPhoneOS.platform/Developer/usr/bin:/Users/sai/Downloads/Xcode.app/Contents/Developer/usr/bin:/usr/local/bin:/usr/bin:/bin:/usr/sbin:/sbin:/usr/local/bin/ant"
      
          /bin/chmod -RH u+w,go-w,a+rX /Users/sai/Library/Developer/Xcode/DerivedData/WebIdeCompanion-fyhbmpphzqelbccgxdymhbthhjaf/Build/Intermediates/ArchiveIntermediates/WebIdeCompanion/IntermediateBuildFilesPath/UninstalledProducts/iphoneos/libCordova.a
      
      === BUILD TARGET WebIdeCompanion OF PROJECT WebIdeCompanion WITH CONFIGURATION Debug ===
      
      Check dependencies
      
      Signing for "WebIdeCompanion" requires a development team. Select a development team in the project editor.
      
      warning: no rule to process file '/Users/sai/Downloads/tsk/SAP_HAT_local-1.27.4/WebIdeCompanion/companionapp/CompanionApp/platforms/ios/WebIdeCompanion/Plugins/cordova-plugin-privacyscreen/PrivacyScreenPlugin.h' of type sourcecode.c.h for architecture armv7
      
      warning: no rule to process file '/Users/sai/Downloads/tsk/SAP_HAT_local-1.27.4/WebIdeCompanion/companionapp/CompanionApp/platforms/ios/WebIdeCompanion/Plugins/cordova-plugin-privacyscreen/PrivacyScreenPlugin.h' of type sourcecode.c.h for architecture arm64
      
      Code signing is required for product type 'Application' in SDK 'iOS 10.2'
      
      ** ARCHIVE FAILED **
      
      The following build commands failed:
      
      Check dependencies
      
      (1 failure)
      
      Error: Error code 65 for command: xcodebuild with args: -xcconfig,/Users/sai/Downloads/tsk/SAP_HAT_local-1.27.4/WebIdeCompanion/companionapp/CompanionApp/platforms/ios/cordova/build-debug.xcconfig,-workspace,WebIdeCompanion.xcworkspace,-scheme,WebIdeCompanion,-configuration,Debug,-destination,generic/platform=iOS,-archivePath,WebIdeCompanion.xcarchive,archive,CONFIGURATION_BUILD_DIR=/Users/sai/Downloads/tsk/SAP_HAT_local-1.27.4/WebIdeCompanion/companionapp/CompanionApp/platforms/ios/build/device,SHARED_PRECOMPS_DIR=/Users/sai/Downloads/tsk/SAP_HAT_local-1.27.4/WebIdeCompanion/companionapp/CompanionApp/platforms/ios/build/sharedpch
      
      cmd error
      
      The node process of the build script exited with code 1.
      
      ===================================================
      
      
      

       

      (0) 
      1. Sai Krishna

        Hi All, Quick update:

        Even with the above error, i am able to run the HAT 1.28.2 🙂

        So, the above error seems to be affecting CompanionApp only but HAT works normally.

        I am able to deploy an offline app from web-ide onto my Mac now. Yay!

        (0) 
  9. Philippe DAmato

    Hi Guys –

     

    Any Update on the above issue. I am also facing the Same issue.  Not sure what is going and this happening after upgrading the

     

    Thanks

    Ram

    (0) 

Leave a Reply